{"text_format":"1","workbook":"xlsx","n_sheets":9,"sheets":["Vejledning","Basisoplysninger","Energiforbrug og CO2-udledning","Screeningsliste energi","Screeningsliste CO2","Handlingsplan","Energiforbrug ifm. certifikat","Definitioner","Hjælpedata"],"not_rendered":{"charts":0,"images":1,"macros":1,"external_links":0,"defined_names":16,"comments":3,"pivot_tables":0},"unopened":[],"bounds":{"document_bytes":16777216,"sheet_cells":100000,"rows_first":2000,"rows_last":500,"rows_between":2000,"halvings":0,"cell_chars":16384,"cell_head_chars":4096},"cells_cut":0,"cells_raw":0,"read":"whole","date_system":"1900"}

{"sheet":"Vejledning","index":0,"n_rows":55,"n_cols":3,"rows_kept":55,"cut":false,"hidden":false,"merged":[[54,2,57,5],[47,2,47,5],[48,2,51,5],[42,2,45,5],[19,2,19,5],[53,2,53,5],[14,2,14,5],[8,2,8,5],[34,2,34,5],[41,2,41,5],[29,2,29,5],[9,2,12,5],[15,2,17,5],[20,2,23,5],[30,2,32,5],[24,2,27,5],[35,2,38,5]]}
[]
[]
[]
[null,null,"Retningslinjer for korrekt indberetning"]
[null,null,"Der kan løbende komme justeringer til indberetningskemaet, brugere opfordres til altid at hente skemaet på www.ens.dk/eek"]
[]
[null,null,"Har du spørgsmål til udfyldelse af blanketten, er du velkommen til at kontakte Energistyrelsen på eek@ens.dk eller på tlf: +45 33926688"]
[null,null,"Link til vejledning "]
{"$rows_left_out":48}
{"sheet":"Basisoplysninger","index":1,"n_rows":27,"n_cols":18,"rows_kept":27,"cut":false,"hidden":false,"merged":[[3,7,3,8],[5,7,5,8],[7,7,7,8]]}
[null,"Stamdata"]
[null,"Link til vejledning"]
[null,"CVR",null,"Branchekode",null,"Region",null,"Udførende virksomhed",null,null,"Virksomhedsnavn ",null,"Dato for udførelse (DD-MM-ÅÅÅÅ)"]
[null,null,null,null,null,null,null,null,null,null,null,null,null,null," ","Fuldt energiforbrug [MWh]","Indberettet energiforbrug [MWh]","Kommentarer"]
[null,"Tilknyttede CVR",null,"Branchekode",null,"Region",null,"E-mail",null,null,"E-mail",null,"Senest godkendte indberetning af energisyn eller energiledelse",null,"Energifoprbrug "]
[null,null,null,null,null,null,null,null,null,null,null,null,null,null,"Samlet energibesparelse"]
[null,null,null,null,null,null,null,"Tlf nummer",null,null,"Tlf nummer",null,"Senest godkendte indberetning af klimasyn",null,null,"Fuld CO2-udledning [ton]","Indberettet CO2-udlednning [ton]"]
[null,null,null,null,null,null,null,null,null,null,null,null,null,null,"CO2 udledning i perioden"]
{"$rows_left_out":20}
{"sheet":"Energiforbrug og CO2-udledning","index":2,"n_rows":32,"n_cols":51,"rows_kept":32,"cut":false,"hidden":false,"merged":[[6,43,6,44],[8,32,14,32],[15,32,16,32],[17,32,18,32],[19,32,28,32],[6,35,6,42],[4,4,4,5],[4,7,4,8],[16,0,17,0],[16,28,29,30],[9,0,15,0],[20,0,29,0],[18,0,19,0],[6,11,6,12],[6,28,6,30],[6,3,6,9],[6,15,6,22],[6,23,6,25]]}
["Energiforbrug og CO2-udledning ",null,null,null,null,null,null,null,null,null,null,null,null,null,null,null,null,null,null,null,null,null,null,null,null,null,null,null,null,null,null,null,"CO2-udledning ved klimasyn "]
[null,null,null,null,null,null,null,null,null,null,null,null,null,null,null,null,null,null,null,null,null,null,null,null,null,null,null,null,null,null,null,null,null,null,null,null,null,null,null,null,null,null,"Type ","Ikke energirelaterede CO2-udledninger [ton CO2]"]
["Totalt energiforbrug samt CO2-udledning de seneste 12 måneder"]
[null,null,null,"Måleperiode for indtastet energiforbrug:"]
["Nr. P-enhed:",1,null,"Startdato: ",null,null,"Slutdato:"]
[]
["Nr. P-enhed:",1,"I alt","OLIEPRODUKTER",null,null,null,null,null,null,null,"GAS",null,"KUL-KOKS","AFFALD","VEDVARENDE ENERGI",null,null,null,null,null,null,null,"VARMEPUMPER",null,null,null,null,"TEMPERATUR, ANDEL AF TOTAL PROCESVARMEFORBRUG",null,null,null,"Nr. P-enhed:",1,"I alt","OLIEPRODUKTER",null,null,null,null,null,null,null,"GAS",null,"KUL-KOKS","AFFALD",null,null,"Energiart","ton CO2 pr. MWh"]
["Nr. P-enhed:","<Indtast P-nummer>","MWh","LPG","Benzin og LVN","Gas & Dieselolie","Petroleum","Diesel","Fuelolie og Spildolie","Petrokoks","JP1 og JP4","Ledningsgas","Raffinaderigas ","Kul & koks","Affald, ikke bionedbrydeligt","Affald, bionedbrydeligt","Halm","Skovflis","Træpiller","Træaffald og brænde","Biogas","Solvarme","Bioolie","Varmepumpe - omgivelsesvarme","El til varmepumper","Overskudsvarme fra varmepumper","Elektricitet i alt","Fjernvarme","<100oC","100-200oC",">200oC",null,"Nr. P-enhed:",{"$f":"B8","v":"<Indtast P-nummer>"},"ton CO2","LPG","Benzin og LVN","Gas & Dieselolie","Petroleum","Diesel","Fuelolie og Spildolie","Petrokoks","JP1 og JP4","Ledningsgas","Raffinaderigas ","Kul & koks","Affald, ikke bionedbrydeligt",null,null,"Affald, ikke bionedbrydeligt",0.33998400000000001]
{"$rows_left_out":25}
{"sheet":"Screeningsliste energi","index":3,"n_rows":43,"n_cols":21,"rows_kept":43,"cut":false,"hidden":false,"merged":[[26,2,26,7],[24,1,24,4],[3,2,3,7],[3,8,3,16],[26,8,26,16]]}
[null,"Energibesparelsestiltag"]
[]
[]
[null,null,"Projektinformation",null,null,null,null,null,"Besparelse/år"]
[null,"Nummer","Projektnavn","Anvendelsesområde","Underområde","Støttemuligheder","Levetid [år]","Invest. [kr]","Energiart","Sekundær energiart","Besparelse af energiart \n[MWh/år]","Besparelse af sekundær energiart \n[MWh/år]","CO2 Reduktion \n[ton CO2/år]","CO2 Reduktion sekundær energiart\n[ton CO2/år]","Besparelse [dkk/år]","Forhøjede driftsomkostninger [dkk/år] ","Forhøjet el-forbrug [MWh/år]","Tilbagebetalinsgtid","Omkostning pr ton CO2 reduceret","Diskonteringssatsen for hele perioden [%]","Nutidsværdi "]
[null,1,null,null,null,null,null,null,null,null,null,null,{"$f":"IFERROR(IF(OR(K6=\"\",I6=\"\"),\"-\",K6*VLOOKUP(I6,Hjælpedata!$P$3:$Q$24,2)),\"-\")","v":"-"},{"$f":"IFERROR(IF(OR(L6=\"\",J6=\"\"),\"-\",L6*VLOOKUP(J6,Hjælpedata!$P$3:$Q$24,2)),\"-\")","v":"-"},null,null,null,{"$f":"IFERROR(H6/O6,\"-\")","v":"-"},{"$f":"IFERROR(H6/((M6+N6)*G6),\"-\")","v":"-"},null,{"$f":"IF(NOT(G6=\"\"),-PV(T6,G6,O6)-H6,\"-\")","v":"-"}]
[null,{"$f":"B6+1","v":2},null,null,null,null,null,null,null,null,null,null,{"$f":"IFERROR(IF(OR(K7=\"\",I7=\"\"),\"-\",K7*VLOOKUP(I7,Hjælpedata!$P$3:$Q$24,2)),\"-\")","v":"-"},{"$f":"IFERROR(IF(OR(L7=\"\",J7=\"\"),\"-\",L7*VLOOKUP(J7,Hjælpedata!$P$3:$Q$24,2)),\"-\")","v":"-"},null,null,null,"-",{"$f":"IFERROR(H7/((M7+N7)*G7),\"-\")","v":"-"},null,"-"]
[null,{"$f":"B7+1","v":3},null,null,null,null,null,null,null,null,null,null,{"$f":"IFERROR(IF(OR(K8=\"\",I8=\"\"),\"-\",K8*VLOOKUP(I8,Hjælpedata!$P$3:$Q$24,2)),\"-\")","v":"-"},{"$f":"IFERROR(IF(OR(L8=\"\",J8=\"\"),\"-\",L8*VLOOKUP(J8,Hjælpedata!$P$3:$Q$24,2)),\"-\")","v":"-"},null,null,null,"-","-",null,"-"]
{"$rows_left_out":36}
{"sheet":"Screeningsliste CO2","index":4,"n_rows":43,"n_cols":21,"rows_kept":43,"cut":false,"hidden":false,"merged":[[3,2,3,7],[26,2,26,7],[23,1,23,4],[26,8,26,13],[3,8,3,13]]}
[null,"Screeningsliste for CO2-reducerende tiltag"]
[]
[]
[null,null,"Projektinformation",null,null,null,null,null,"Besparelse/år"]
[null,null,"Projektnavn","Anvendelsesområde","Underområde","Støttemuligheder","Levetid [år]","Invest. [kr]","Energiart","Sekundær energiart","Besparelse af energiart \n[MWh/år]","Besparelse af sekundær energiart \n[MWh/år]","CO2 Reduktion \n[ton CO2/år]","CO2 Reduktion sekundær energiart\n[ton CO2/år]","Besparelse [dkk/år]","Forhøjede drifts-omkostninger [dkk/år] ","Forhøjet el-forbrug [MWh/år]","Tilbagebetalings-tid","Omkostning pr ton CO2 reduceret","Diskonteringssatsen for hele perioden [%]","Nutidsværdi "]
[null,1,null,null,null,null,null,null,null,null,null,null,{"$f":"IFERROR(IF(OR(K6=\"\",I6=\"\"),\"-\",K6*VLOOKUP(I6,Hjælpedata!$P$3:$Q$24,2)),\"-\")","v":"-"},{"$f":"IFERROR(IF(OR(L6=\"\",J6=\"\"),\"-\",L6*VLOOKUP(J6,Hjælpedata!$P$3:$Q$24,2)),\"-\")","v":"-"},null,null,null,{"$f":"IFERROR(H6/O6,\"-\")","v":"-"},{"$f":"IFERROR(H6/((M6+N6)*G6),\"-\")","v":"-"},null,{"$f":"IF(NOT(G6=\"\"),-PV(T6,G6,O6)-H6,\"-\")","v":"-"}]
[null,{"$f":"B6+1","v":2},null,null,null,null,null,null,null,null,null,null,{"$f":"IFERROR(IF(OR(K7=\"\",I7=\"\"),\"-\",K7*VLOOKUP(I7,Hjælpedata!$P$3:$Q$24,2)),\"-\")","v":"-"},{"$f":"IFERROR(IF(OR(L7=\"\",J7=\"\"),\"-\",L7*VLOOKUP(J7,Hjælpedata!$P$3:$Q$24,2)),\"-\")","v":"-"},null,null,null,"-",{"$f":"IFERROR(H7/((M7+N7)*G7),\"-\")","v":"-"},null,"-"]
[null,{"$f":"B7+1","v":3},null,null,null,null,null,null,null,null,null,null,{"$f":"IFERROR(IF(OR(K8=\"\",I8=\"\"),\"-\",K8*VLOOKUP(I8,Hjælpedata!$P$3:$Q$24,2)),\"-\")","v":"-"},{"$f":"IFERROR(IF(OR(L8=\"\",J8=\"\"),\"-\",L8*VLOOKUP(J8,Hjælpedata!$P$3:$Q$24,2)),\"-\")","v":"-"},null,null,null,"-","-",null,"-"]
{"$rows_left_out":36}
{"sheet":"Handlingsplan","index":5,"n_rows":33,"n_cols":24,"rows_kept":33,"cut":false,"hidden":false,"merged":[[0,0,0,1],[1,0,1,1]]}
["Handlingsplan"]
["Indsæt præcist det samme projektnavn som angivet i \"Screeningsliste energi\" og \"Screeningsliste CO2\" fanerne, da data hentes automatisk"]
[]
[null,"Indsæt projektnavn","Gennemføres dette projekt","Anvendelsesområde","Underområde","Støttemuligheder","Levetid [år]","Invest. [kr]","Energiart","Sekundær energiart","Besparelse af energiart \n[MWh/år]","Besparelse af sekundær energiart \n[MWh/år]","CO2 Reduktion \n[ton CO2/år]","CO2 Reduktion sekundær energiart\n[ton CO2/år]","Besparelse [dkk/år]","Forhøjede driftsomkostninger [dkk/år] ","Forhøjet el-forbrug [MWh/år]","Tilbagebetalinsgtid",null,null,null,"Omkostning pr ton CO2 reduceret","Diskonteringssatsen for hele perioden [%]","Nutidsværdi "]
[null,null,null,{"$f":"IFERROR(IFERROR(VLOOKUP($B5,'Screeningsliste CO2'!$C$6:$U$20,2,FALSE),VLOOKUP($B5,'Screeningsliste energi'!$C$5:$U$19,2,FALSE)),\"-\")","v":"-"},{"$f":"IFERROR(IFERROR(VLOOKUP($B5,'Screeningsliste CO2'!$C$6:$U$20,3,FALSE),VLOOKUP($B5,'Screeningsliste energi'!$C$5:$U$19,3,FALSE)),\"-\")","v":"-"},{"$f":"IFERROR(IFERROR(VLOOKUP($B5,'Screeningsliste CO2'!$C$6:$U$20,4,FALSE),VLOOKUP($B5,'Screeningsliste energi'!$C$5:$U$19,4,FALSE)),\"-\")","v":"-"},{"$f":"IFERROR(IFERROR(VLOOKUP($B5,'Screeningsliste CO2'!$C$6:$U$20,5,FALSE),VLOOKUP($B5,'Screeningsliste energi'!$C$5:$U$19,5,FALSE)),\"-\")","v":"-"},{"$f":"IFERROR(IFERROR(VLOOKUP($B5,'Screeningsliste CO2'!$C$6:$U$20,6,FALSE),VLOOKUP($B5,'Screeningsliste energi'!$C$5:$U$19,6,FALSE)),\"-\")","v":"-"},{"$f":"IFERROR(IFERROR(VLOOKUP($B5,'Screeningsliste CO2'!$C$6:$U$20,7,FALSE),VLOOKUP($B5,'Screeningsliste energi'!$C$5:$U$19,7,FALSE)),\"-\")","v":"-"},"  ",{"$f":"IFERROR(IFERROR(VLOOKUP($B5,'Screeningsliste CO2'!$C$6:$U$20,9,FALSE),VLOOKUP($B5,'Screeningsliste energi'!$C$5:$U$19,9,FALSE)),\"-\")","v":"-"},{"$f":"IFERROR(IFERROR(VLOOKUP($B5,'Screeningsliste CO2'!$C$6:$U$20,10,FALSE),VLOOKUP($B5,'Screeningsliste energi'!$C$5:$U$19,10,FALSE)),\"-\")","v":"-"},{"$f":"IFERROR(IFERROR(VLOOKUP($B5,'Screeningsliste CO2'!$C$6:$U$20,11,FALSE),VLOOKUP($B5,'Screeningsliste energi'!$C$5:$U$19,11,FALSE)),\"-\")","v":"-"},{"$f":"IFERROR(IFERROR(VLOOKUP($B5,'Screeningsliste CO2'!$C$6:$U$20,12,FALSE),VLOOKUP($B5,'Screeningsliste energi'!$C$5:$U$19,12,FALSE)),\"-\")","v":"-"},{"$f":"IFERROR(IFERROR(VLOOKUP($B5,'Screeningsliste CO2'!$C$6:$U$20,13,FALSE),VLOOKUP($B5,'Screeningsliste energi'!$C$5:$U$20,13,FALSE)),\"-\")","v":"-"},{"$f":"IFERROR(IFERROR(VLOOKUP($B5,'Screeningsliste CO2'!$C$6:$U$20,14,FALSE),VLOOKUP($B5,'Screeningsliste energi'!$C$5:$U$20,14,FALSE)),\"-\")","v":"-"},{"$f":"IFERROR(IFERROR(VLOOKUP($B5,'Screeningsliste CO2'!$C$6:$U$20,15,FALSE),VLOOKUP($B5,'Screeningsliste energi'!$C$5:$U$20,15,FALSE)),\"-\")","v":"-"},{"$f":"IFERROR(IFERROR(VLOOKUP($B5,'Screeningsliste CO2'!$C$6:$U$20,16,FALSE),VLOOKUP($B5,'Screeningsliste energi'!$C$5:$U$20,16,FALSE)),\"-\")","v":"-"},{"$f":"IFERROR(IFERROR(VLOOKUP($B5,'Screeningsliste CO2'!$C$6:$T$20,16,FALSE),VLOOKUP($B5,'Screeningsliste energi'!$C$5:$U$14,16,FALSE)),\"-\")","v":"-"},{"$f":"IFERROR(IFERROR(VLOOKUP($B5,'Screeningsliste CO2'!$C$6:$T$20,16,FALSE),VLOOKUP($B5,'Screeningsliste energi'!$C$5:$U$14,16,FALSE)),\"-\")","v":"-"},{"$f":"IFERROR(IFERROR(VLOOKUP($B5,'Screeningsliste CO2'!$C$6:$T$20,16,FALSE),VLOOKUP($B5,'Screeningsliste energi'!$C$5:$U$14,16,FALSE)),\"-\")","v":"-"},{"$f":"IFERROR(IFERROR(VLOOKUP($B5,'Screeningsliste CO2'!$C$6:$U$20,17,FALSE),VLOOKUP($B5,'Screeningsliste energi'!$C$5:$U$20,17,FALSE)),\"-\")","v":"-"},{"$f":"IFERROR(IFERROR(VLOOKUP($B5,'Screeningsliste CO2'!$C$6:$U$20,18,FALSE),VLOOKUP($B5,'Screeningsliste energi'!$C$5:$U$20,18,FALSE)),\"-\")","v":"-"},{"$f":"IFERROR(IFERROR(VLOOKUP($B5,'Screeningsliste CO2'!$C$6:$U$20,19,FALSE),VLOOKUP($B5,'Screeningsliste energi'!$C$5:$U$20,19,FALSE)),\"-\")","v":"-"}]
[null,null,null,{"$f":"IFERROR(IFERROR(VLOOKUP($B6,'Screeningsliste CO2'!$C$6:$U$20,2,FALSE),VLOOKUP($B6,'Screeningsliste energi'!$C$5:$U$19,2,FALSE)),\"-\")","v":"-"},{"$f":"IFERROR(IFERROR(VLOOKUP($B6,'Screeningsliste CO2'!$C$6:$U$20,3,FALSE),VLOOKUP($B6,'Screeningsliste energi'!$C$5:$U$19,3,FALSE)),\"-\")","v":"-"},{"$f":"IFERROR(IFERROR(VLOOKUP($B6,'Screeningsliste CO2'!$C$6:$U$20,4,FALSE),VLOOKUP($B6,'Screeningsliste energi'!$C$5:$U$19,4,FALSE)),\"-\")","v":"-"},{"$f":"IFERROR(IFERROR(VLOOKUP($B6,'Screeningsliste CO2'!$C$6:$U$20,5,FALSE),VLOOKUP($B6,'Screeningsliste energi'!$C$5:$U$19,5,FALSE)),\"-\")","v":"-"},{"$f":"IFERROR(IFERROR(VLOOKUP($B6,'Screeningsliste CO2'!$C$6:$U$20,6,FALSE),VLOOKUP($B6,'Screeningsliste energi'!$C$5:$U$19,6,FALSE)),\"-\")","v":"-"},{"$f":"IFERROR(IFERROR(VLOOKUP($B6,'Screeningsliste CO2'!$C$6:$U$20,7,FALSE),VLOOKUP($B6,'Screeningsliste energi'!$C$5:$U$19,7,FALSE)),\"-\")","v":"-"},{"$f":"IFERROR(IFERROR(VLOOKUP($B6,'Screeningsliste CO2'!$C$6:$U$20,8,FALSE),VLOOKUP($B6,'Screeningsliste energi'!$C$5:$U$19,8,FALSE)),\"-\")","v":"-"},{"$f":"IFERROR(IFERROR(VLOOKUP($B6,'Screeningsliste CO2'!$C$6:$U$20,9,FALSE),VLOOKUP($B6,'Screeningsliste energi'!$C$5:$U$19,9,FALSE)),\"-\")","v":"-"},{"$f":"IFERROR(IFERROR(VLOOKUP($B6,'Screeningsliste CO2'!$C$6:$U$20,10,FALSE),VLOOKUP($B6,'Screeningsliste energi'!$C$5:$U$19,10,FALSE)),\"-\")","v":"-"},{"$f":"IFERROR(IFERROR(VLOOKUP($B6,'Screeningsliste CO2'!$C$6:$U$20,11,FALSE),VLOOKUP($B6,'Screeningsliste energi'!$C$5:$U$19,11,FALSE)),\"-\")","v":"-"},{"$f":"IFERROR(IFERROR(VLOOKUP($B6,'Screeningsliste CO2'!$C$6:$U$20,12,FALSE),VLOOKUP($B6,'Screeningsliste energi'!$C$5:$U$19,12,FALSE)),\"-\")","v":"-"},{"$f":"IFERROR(IFERROR(VLOOKUP($B6,'Screeningsliste CO2'!$C$6:$U$20,13,FALSE),VLOOKUP($B6,'Screeningsliste energi'!$C$5:$U$20,13,FALSE)),\"-\")","v":"-"},{"$f":"IFERROR(IFERROR(VLOOKUP($B6,'Screeningsliste CO2'!$C$6:$U$20,14,FALSE),VLOOKUP($B6,'Screeningsliste energi'!$C$5:$U$20,14,FALSE)),\"-\")","v":"-"},{"$f":"IFERROR(IFERROR(VLOOKUP($B6,'Screeningsliste CO2'!$C$6:$U$20,15,FALSE),VLOOKUP($B6,'Screeningsliste energi'!$C$5:$U$20,15,FALSE)),\"-\")","v":"-"},{"$f":"IFERROR(IFERROR(VLOOKUP($B6,'Screeningsliste CO2'!$C$6:$U$20,16,FALSE),VLOOKUP($B6,'Screeningsliste energi'!$C$5:$U$20,16,FALSE)),\"-\")","v":"-"},{"$f":"IFERROR(IFERROR(VLOOKUP($B6,'Screeningsliste CO2'!$C$6:$T$20,3,FALSE),VLOOKUP($B6,'Screeningsliste energi'!$C$5:$U$19,3,FALSE)),\"-\")","v":"-"},{"$f":"IFERROR(IFERROR(VLOOKUP($B6,'Screeningsliste CO2'!$C$6:$T$20,3,FALSE),VLOOKUP($B6,'Screeningsliste energi'!$C$5:$U$19,3,FALSE)),\"-\")","v":"-"},{"$f":"IFERROR(IFERROR(VLOOKUP($B6,'Screeningsliste CO2'!$C$6:$T$20,3,FALSE),VLOOKUP($B6,'Screeningsliste energi'!$C$5:$U$19,3,FALSE)),\"-\")","v":"-"},{"$f":"IFERROR(IFERROR(VLOOKUP($B6,'Screeningsliste CO2'!$C$6:$U$20,17,FALSE),VLOOKUP($B6,'Screeningsliste energi'!$C$5:$U$20,17,FALSE)),\"-\")","v":"-"},{"$f":"IFERROR(IFERROR(VLOOKUP($B6,'Screeningsliste CO2'!$C$6:$U$20,18,FALSE),VLOOKUP($B6,'Screeningsliste energi'!$C$5:$U$20,18,FALSE)),\"-\")","v":"-"},{"$f":"IFERROR(IFERROR(VLOOKUP($B6,'Screeningsliste CO2'!$C$6:$U$20,19,FALSE),VLOOKUP($B6,'Screeningsliste energi'!$C$5:$U$20,19,FALSE)),\"-\")","v":"-"}]
[null,null,null,{"$f":"IFERROR(IFERROR(VLOOKUP($B7,'Screeningsliste CO2'!$C$6:$U$20,2,FALSE),VLOOKUP($B7,'Screeningsliste energi'!$C$5:$U$19,2,FALSE)),\"-\")","v":"-"},{"$f":"IFERROR(IFERROR(VLOOKUP($B7,'Screeningsliste CO2'!$C$6:$U$20,3,FALSE),VLOOKUP($B7,'Screeningsliste energi'!$C$5:$U$19,3,FALSE)),\"-\")","v":"-"},{"$f":"IFERROR(IFERROR(VLOOKUP($B7,'Screeningsliste CO2'!$C$6:$U$20,4,FALSE),VLOOKUP($B7,'Screeningsliste energi'!$C$5:$U$19,4,FALSE)),\"-\")","v":"-"},{"$f":"IFERROR(IFERROR(VLOOKUP($B7,'Screeningsliste CO2'!$C$6:$U$20,5,FALSE),VLOOKUP($B7,'Screeningsliste energi'!$C$5:$U$19,5,FALSE)),\"-\")","v":"-"},{"$f":"IFERROR(IFERROR(VLOOKUP($B7,'Screeningsliste CO2'!$C$6:$U$20,6,FALSE),VLOOKUP($B7,'Screeningsliste energi'!$C$5:$U$19,6,FALSE)),\"-\")","v":"-"},{"$f":"IFERROR(IFERROR(VLOOKUP($B7,'Screeningsliste CO2'!$C$6:$U$20,7,FALSE),VLOOKUP($B7,'Screeningsliste energi'!$C$5:$U$19,7,FALSE)),\"-\")","v":"-"},{"$f":"IFERROR(IFERROR(VLOOKUP($B7,'Screeningsliste CO2'!$C$6:$U$20,8,FALSE),VLOOKUP($B7,'Screeningsliste energi'!$C$5:$U$19,8,FALSE)),\"-\")","v":"-"},{"$f":"IFERROR(IFERROR(VLOOKUP($B7,'Screeningsliste CO2'!$C$6:$U$20,9,FALSE),VLOOKUP($B7,'Screeningsliste energi'!$C$5:$U$19,9,FALSE)),\"-\")","v":"-"},{"$f":"IFERROR(IFERROR(VLOOKUP($B7,'Screeningsliste CO2'!$C$6:$U$20,10,FALSE),VLOOKUP($B7,'Screeningsliste energi'!$C$5:$U$19,10,FALSE)),\"-\")","v":"-"},{"$f":"IFERROR(IFERROR(VLOOKUP($B7,'Screeningsliste CO2'!$C$6:$U$20,11,FALSE),VLOOKUP($B7,'Screeningsliste energi'!$C$5:$U$19,11,FALSE)),\"-\")","v":"-"},{"$f":"IFERROR(IFERROR(VLOOKUP($B7,'Screeningsliste CO2'!$C$6:$U$20,12,FALSE),VLOOKUP($B7,'Screeningsliste energi'!$C$5:$U$19,12,FALSE)),\"-\")","v":"-"},{"$f":"IFERROR(IFERROR(VLOOKUP($B7,'Screeningsliste CO2'!$C$6:$U$20,13,FALSE),VLOOKUP($B7,'Screeningsliste energi'!$C$5:$U$20,13,FALSE)),\"-\")","v":"-"},{"$f":"IFERROR(IFERROR(VLOOKUP($B7,'Screeningsliste CO2'!$C$6:$U$20,14,FALSE),VLOOKUP($B7,'Screeningsliste energi'!$C$5:$U$20,14,FALSE)),\"-\")","v":"-"},{"$f":"IFERROR(IFERROR(VLOOKUP($B7,'Screeningsliste CO2'!$C$6:$U$20,15,FALSE),VLOOKUP($B7,'Screeningsliste energi'!$C$5:$U$20,15,FALSE)),\"-\")","v":"-"},{"$f":"IFERROR(IFERROR(VLOOKUP($B7,'Screeningsliste CO2'!$C$6:$U$20,16,FALSE),VLOOKUP($B7,'Screeningsliste energi'!$C$5:$U$20,16,FALSE)),\"-\")","v":"-"},{"$f":"IFERROR(IFERROR(VLOOKUP($B7,'Screeningsliste CO2'!$C$6:$T$20,3,FALSE),VLOOKUP($B7,'Screeningsliste energi'!$C$5:$U$19,3,FALSE)),\"-\")","v":"-"},{"$f":"IFERROR(IFERROR(VLOOKUP($B7,'Screeningsliste CO2'!$C$6:$T$20,3,FALSE),VLOOKUP($B7,'Screeningsliste energi'!$C$5:$U$19,3,FALSE)),\"-\")","v":"-"},{"$f":"IFERROR(IFERROR(VLOOKUP($B7,'Screeningsliste CO2'!$C$6:$T$20,3,FALSE),VLOOKUP($B7,'Screeningsliste energi'!$C$5:$U$19,3,FALSE)),\"-\")","v":"-"},{"$f":"IFERROR(IFERROR(VLOOKUP($B7,'Screeningsliste CO2'!$C$6:$U$20,17,FALSE),VLOOKUP($B7,'Screeningsliste energi'!$C$5:$U$20,17,FALSE)),\"-\")","v":"-"},{"$f":"IFERROR(IFERROR(VLOOKUP($B7,'Screeningsliste CO2'!$C$6:$U$20,18,FALSE),VLOOKUP($B7,'Screeningsliste energi'!$C$5:$U$20,18,FALSE)),\"-\")","v":"-"},{"$f":"IFERROR(IFERROR(VLOOKUP($B7,'Screeningsliste CO2'!$C$6:$U$20,19,FALSE),VLOOKUP($B7,'Screeningsliste energi'!$C$5:$U$20,19,FALSE)),\"-\")","v":"-"}]
[null,null,null,{"$f":"IFERROR(IFERROR(VLOOKUP($B8,'Screeningsliste CO2'!$C$6:$U$20,2,FALSE),VLOOKUP($B8,'Screeningsliste energi'!$C$5:$U$19,2,FALSE)),\"-\")","v":"-"},{"$f":"IFERROR(IFERROR(VLOOKUP($B8,'Screeningsliste CO2'!$C$6:$U$20,3,FALSE),VLOOKUP($B8,'Screeningsliste energi'!$C$5:$U$19,3,FALSE)),\"-\")","v":"-"},{"$f":"IFERROR(IFERROR(VLOOKUP($B8,'Screeningsliste CO2'!$C$6:$U$20,4,FALSE),VLOOKUP($B8,'Screeningsliste energi'!$C$5:$U$19,4,FALSE)),\"-\")","v":"-"},{"$f":"IFERROR(IFERROR(VLOOKUP($B8,'Screeningsliste CO2'!$C$6:$U$20,5,FALSE),VLOOKUP($B8,'Screeningsliste energi'!$C$5:$U$19,5,FALSE)),\"-\")","v":"-"},{"$f":"IFERROR(IFERROR(VLOOKUP($B8,'Screeningsliste CO2'!$C$6:$U$20,6,FALSE),VLOOKUP($B8,'Screeningsliste energi'!$C$5:$U$19,6,FALSE)),\"-\")","v":"-"},{"$f":"IFERROR(IFERROR(VLOOKUP($B8,'Screeningsliste CO2'!$C$6:$U$20,7,FALSE),VLOOKUP($B8,'Screeningsliste energi'!$C$5:$U$19,7,FALSE)),\"-\")","v":"-"},{"$f":"IFERROR(IFERROR(VLOOKUP($B8,'Screeningsliste CO2'!$C$6:$U$20,8,FALSE),VLOOKUP($B8,'Screeningsliste energi'!$C$5:$U$19,8,FALSE)),\"-\")","v":"-"},{"$f":"IFERROR(IFERROR(VLOOKUP($B8,'Screeningsliste CO2'!$C$6:$U$20,9,FALSE),VLOOKUP($B8,'Screeningsliste energi'!$C$5:$U$19,9,FALSE)),\"-\")","v":"-"},{"$f":"IFERROR(IFERROR(VLOOKUP($B8,'Screeningsliste CO2'!$C$6:$U$20,10,FALSE),VLOOKUP($B8,'Screeningsliste energi'!$C$5:$U$19,10,FALSE)),\"-\")","v":"-"},{"$f":"IFERROR(IFERROR(VLOOKUP($B8,'Screeningsliste CO2'!$C$6:$U$20,11,FALSE),VLOOKUP($B8,'Screeningsliste energi'!$C$5:$U$19,11,FALSE)),\"-\")","v":"-"},{"$f":"IFERROR(IFERROR(VLOOKUP($B8,'Screeningsliste CO2'!$C$6:$U$20,12,FALSE),VLOOKUP($B8,'Screeningsliste energi'!$C$5:$U$19,12,FALSE)),\"-\")","v":"-"},{"$f":"IFERROR(IFERROR(VLOOKUP($B8,'Screeningsliste CO2'!$C$6:$U$20,13,FALSE),VLOOKUP($B8,'Screeningsliste energi'!$C$5:$U$20,13,FALSE)),\"-\")","v":"-"},{"$f":"IFERROR(IFERROR(VLOOKUP($B8,'Screeningsliste CO2'!$C$6:$U$20,14,FALSE),VLOOKUP($B8,'Screeningsliste energi'!$C$5:$U$20,14,FALSE)),\"-\")","v":"-"},{"$f":"IFERROR(IFERROR(VLOOKUP($B8,'Screeningsliste CO2'!$C$6:$U$20,15,FALSE),VLOOKUP($B8,'Screeningsliste energi'!$C$5:$U$20,15,FALSE)),\"-\")","v":"-"},{"$f":"IFERROR(IFERROR(VLOOKUP($B8,'Screeningsliste CO2'!$C$6:$U$20,16,FALSE),VLOOKUP($B8,'Screeningsliste energi'!$C$5:$U$20,16,FALSE)),\"-\")","v":"-"},{"$f":"IFERROR(IFERROR(VLOOKUP($B8,'Screeningsliste CO2'!$C$6:$T$20,3,FALSE),VLOOKUP($B8,'Screeningsliste energi'!$C$5:$U$19,3,FALSE)),\"-\")","v":"-"},{"$f":"IFERROR(IFERROR(VLOOKUP($B8,'Screeningsliste CO2'!$C$6:$T$20,3,FALSE),VLOOKUP($B8,'Screeningsliste energi'!$C$5:$U$19,3,FALSE)),\"-\")","v":"-"},{"$f":"IFERROR(IFERROR(VLOOKUP($B8,'Screeningsliste CO2'!$C$6:$T$20,3,FALSE),VLOOKUP($B8,'Screeningsliste energi'!$C$5:$U$19,3,FALSE)),\"-\")","v":"-"},{"$f":"IFERROR(IFERROR(VLOOKUP($B8,'Screeningsliste CO2'!$C$6:$U$20,17,FALSE),VLOOKUP($B8,'Screeningsliste energi'!$C$5:$U$20,17,FALSE)),\"-\")","v":"-"},{"$f":"IFERROR(IFERROR(VLOOKUP($B8,'Screeningsliste CO2'!$C$6:$U$20,18,FALSE),VLOOKUP($B8,'Screeningsliste energi'!$C$5:$U$20,18,FALSE)),\"-\")","v":"-"},{"$f":"IFERROR(IFERROR(VLOOKUP($B8,'Screeningsliste CO2'!$C$6:$U$20,19,FALSE),VLOOKUP($B8,'Screeningsliste energi'!$C$5:$U$20,19,FALSE)),\"-\")","v":"-"}]
{"$rows_left_out":26}
{"sheet":"Energiforbrug ifm. certifikat","index":6,"n_rows":15,"n_cols":8,"rows_kept":15,"cut":false,"hidden":true,"merged":[[17,3,17,9],[15,1,15,7],[14,1,14,7]]}
[]
[]
[]
[null,"CVR. nr.","Årstal for seneste års opgjorte energiforbrug","Energiforbrug i hele virksomheden, MWh","Energiforbrug omfattet af certifikatet, MWh","Evt. energiforbrug omfattet af almindeligt energisyn, MWh","Evt. undtaget energiforbrug* MWh","Beregnet andel omfattet af certifikat, procent"]
[null,null,null,null,null,null,null,{"$f":"IFERROR((E5)/D5,\"-\")","v":"-"}]
[null,null,null,null,null,null,null,{"$f":"IFERROR((E6)/D6,\"-\")","v":"-"}]
[null,null,null,null,null,null,null,"-"]
[null,null,null,null,null,null,null,"-"]
{"$rows_left_out":8}
{"sheet":"Definitioner","index":7,"n_rows":38,"n_cols":3,"rows_kept":38,"cut":false,"hidden":false,"merged":[]}
[]
[null,"Definitioner "]
[]
[null,"Varmepumper"]
[null,"Varmepumpe - omgivelsesvarme","Energimængde brugt fra en varmepumpe - ikke inkluderet det elforbrug der er brugt til varmepumpen"]
[null,"El til varmepumper","Her skrives det energiforbrug der er blevet brugt til varmepumpen"]
[null,"Overskudsvarme fra varmepumper","Overskudsvarme udnyttet fra varmepumper"]
[null,"Konverterede energiarter "]
{"$rows_left_out":31}
{"sheet":"Hjælpedata","index":8,"n_rows":737,"n_cols":20,"rows_kept":737,"cut":false,"hidden":true,"merged":[[1,3,1,7],[0,15,0,16]]}
[null,null,null,null,null,null,null,null,null,null,null,"Branchekoder",null,null,null,"Omregningsfaktorer"]
["Anvendelseområder",null,null,"Underområder",null,null,null,null,null,null,null,"011100 Dyrkning af korn (undtagen ris), bælgfrugter og olieholdige frø",null,null,null,"Energiart","ton CO2 pr. MWh",null,"Omregningstabel til CO2 forbrug klimasyn"]
["Anvendelsesområde",null,null,"Intern energiforsyning","Procesvarme","Transport","Rumvarme","Sekundær energi",null,null,"Omregningsfaktorer","011200 Dyrkning af ris","Region","VBA til P-enhed","Gennførelsesgrad","Affald, bionedbrydeligt",0,null,"Energiart","ton CO2 pr. MWh"]
["Intern energiforsyning",null,null,"Konverterings- og nettab","Opvarmning/kogning ","Arbejdskørsel ","Rumvarme ","Belysning",null,null,"Affald, bionedbrydeligt","011300 Dyrkning af grøntsager og meloner, rødder og rodknolde","Nordjylland",1,"Ja","Affald, ikke bionedbrydeligt",0.33998400000000001,null,"Affald, ikke bionedbrydeligt",0.33998400000000001]
["Procesvarme",null,null,"Konverterings- og nettab","Tørring ","Vejtransport (offentlig vej)","Rumkøling ","Pumpning",null,null,"Affald, ikke bionedbrydeligt","011400 Dyrkning af sukkerrør","Midjylland",2,"Nej","Benzin og LVN",0.26279999999999998,null,"Benzin og LVN",0.26279999999999998]
["Transport",null,null,null,"Inddampning ",null,null,"Køl/frys (ekskl. rumkøling)",null,null,"Benzin og LVN","011500 Dyrkning af tobak","Syddanmark",3,null,"Biodiesel",0,null,"Diesel",0.26700000000000002]
["Rumvarme",null,null,null,"Destillation ",null,null,"Rumventilation",null,null,"Biodiesel","011600 Dyrkning af tekstilplanter","Sjælland",4,null,"Bioethanol",0,null,"Fuelolie og Spildolie",0.28242]
["Sekundær energi",null,null,null,"Brænding/sintring",null,null,"Blæsere",null,null,"Bioethanol","011900 Dyrkning af andre etårige afgrøder","Hovedstaden",5,null,"Biogas",0,null,"Gas & Dieselolie",0.26676]
{"$rows_left_out":729}